{"text_format":"1","workbook":"xlsx","n_sheets":6,"sheets":["Introduction","Partie 1","Partie 2a","Partie 2b","Rating","Drop down"],"not_rendered":{"charts":0,"images":2,"macros":1,"external_links":0,"defined_names":9,"comments":0,"pivot_tables":0},"unopened":[],"bounds":{"document_bytes":16777216,"sheet_cells":100000,"rows_first":2000,"rows_last":500,"rows_between":2000,"halvings":0,"cell_chars":16384,"cell_head_chars":4096},"cells_cut":0,"cells_raw":0,"read":"whole","date_system":"1900"}

{"sheet":"Introduction","index":0,"n_rows":34,"n_cols":8,"rows_kept":34,"cut":false,"hidden":false,"merged":[[32,3,32,4],[30,3,30,4],[24,3,24,4],[2,1,2,4],[4,1,4,4],[6,1,6,4],[11,1,11,2],[14,1,14,4],[26,3,26,4],[28,3,28,4]]}
[]
[]
[null,"Évaluation de la conformité aux lignes directrices \ndes ACVM sur la gouvernance\r\nSeptembre 2020",null,null,null,null,null,"Filter"]
[null,null,null,null,null,null,null,"Display"]
[null,"Deloitte a créé cet outil pour vous aider à évaluer vos pratiques de gouvernance et l’information que vous communiquez concernant la gouvernance par rapport à la réglementation des ACVM. Gardez à l’esprit que cette réglementation n’a pas valeur prescriptive. Lorsque l’émetteur assujetti ne se conforme PAS à cette réglementation, une explication sur la manière dont les objectifs de la ligne directrice sont atteints doit être fournie. N’hésitez pas à communiquer avec votre associé Deloitte si vous avez besoin d’assistance.",null,null,null,null,null,"Display"]
[null,null,null,null,null,null,null,"Display"]
[null,"On présume qu’avant de remplir le présent outil d’autoévaluation de l’état de préparation, l’utilisateur a lu le Règlement 58–101 et l’Instruction générale 58–201 et qu’il connaît la réglementation. La liste de contrôle pour l’autoévaluation se divise en deux parties : ",null,null,null,null,null,"Display"]
[null,null,null,null,null,null,null,"Display"]
[null,"Partie 1 : La première partie traite des lignes directrices concernant la gouvernance découlant de l’Instruction générale 58-201.",null,null,null,null,null,"Display"]
[null,"Partie 2 : La deuxième partie reflète les obligations de communication de l’information énoncées dans le Règlement 58-101 et comprend une liste de contrôle distincte pour les émetteurs émergents.",null,null,null,null,null,"Display"]
[null,null,null,null,null,null,null,"Display"]
[null,"Voulez-vous passer en revue les Règlements avant de commencer l’évaluation?",null,null,null,null,null,"Display"]
[null,null,null,null,null,null,null,"Display"]
[null,"Documents de référence",null,null,null,null,null,{"$f":"IF($D$12=\"Oui\",\"Display\",\"Hide\")","v":"Hide"}]
[null,"Vous trouverez ci-dessous des liens vers les normes et vers d’autres documents pertinents auxquels nous faisons référence dans le présent document :",null,null,null,null,null,"Hide"]
[null,null,null,null,null,null,null,"Hide"]
[null,"Documents des Autorités canadiennes en valeurs mobilières (ACVM)",null,null,null,null,null,"Hide"]
[null,"●","Règlement 51-102 sur les obligations d’information continue",null,null,null,null,"Hide"]
[null,"●","Règlement 58-101 sur l’information concernant les pratiques en matière de gouvernance",null,null,null,null,"Hide"]
[null,"●","Instruction générale 58-201, Lignes directrices sur la gouvernance",null,null,null,null,"Hide"]
[null,"●","Règlement 71-102 sur les dispenses en matière d’information continue et autres dispenses en faveur des émetteurs étrangers",null,null,null,null,"Hide"]
[null,null,null,null,null,null,null,"Hide"]
[null,"Êtes-vous prêt à commencer l’évaluation?",null,null,null,null,null,"Display"]
[null,null,null,null,null,null,null,"Display"]
[null,"Sélectionnez ce que vous désirez évaluer :",null,null,null,null,null,{"$f":"IF(D23=\"Oui\",\"Display\",\"Hide\")","v":"Hide"}]
[null,null,null,null,null,null,null,"Display"]
[null,null,null,"Passez à l’onglet Partie 1",null,null,null,{"$f":"IF(D25=\"Pratiques de notre société en matière de gouvernance\",\"Display\",\"Hide\")","v":"Hide"}]
[null,null,null,null,null,null,null,"Display"]
[null,"Sélectionnez en vertu de quelles obligations vous désirez évaluer votre information :",null,null,null,null,null,{"$f":"IF($D$25=\"Information concernant la gouvernance de notre société\",\"Display\",\"Hide\")","v":"Hide"}]
[null,null,null,null,null,null,null,{"$f":"IF($D$25=\"Information concernant la gouvernance de notre société\",\"Display\",\"Hide\")","v":"Hide"}]
[null,null,null,"Passez à l’onglet Partie 2",null,null,null,{"$f":"IF(D29=\"Obligations pour toutes les autres sociétés ouvertes\",\"Display\",\"Hide\")","v":"Hide"}]
[null,null,null,null,null,null,null,{"$f":"H33","v":"Hide"}]
[null,"© Deloitte S.E.N.C.R.L./s.r.l. et ses sociétés affiliées.",null,"Passez à l’onglet Partie 2",null,null,null,{"$f":"IF(D29=\"Obligations pour les émetteurs émergents\",\"Display\",\"Hide\")","v":"Hide"}]
[null,null,null,null,null,null,null,"Display"]

{"sheet":"Partie 1","index":1,"n_rows":190,"n_cols":6,"rows_kept":190,"cut":false,"hidden":false,"merged":[[40,2,41,2],[175,2,178,3],[173,1,173,3],[171,1,171,3],[2,1,2,3],[5,2,5,3],[4,1,4,3],[6,2,6,3],[7,2,7,3]]}
[]
[]
[null,"Partie 1 – Liste de contrôle pour l’autoévaluation – \nLignes directrices sur la gouvernance (Instruction générale 58–201) ",null,null,null,"Filter"]
[null,null,null,null,null,"Display"]
[null,"Chacune des questions ci-dessous doit être précédée de la question suivante : « Respectons-nous l’exigence selon laquelle... ? Les trois réponses possibles sont les suivantes :",null,null,null,"Display"]
[null,"●","« Entièrement conforme » : aucun travail supplémentaire n’est requis.",null,null,"Display"]
[null,"●","« Partiellement conforme – des pratiques existantes doivent être modifiées » : un effort supplémentaire sera nécessaire pour que les pratiques existantes soient conformes à la ligne directrice. ",null,null,"Display"]
[null,"●","« Non conforme – plus d’information doit être communiquée » : bien que la ligne directrice spécifique ne soit pas en place, il existe des pratiques qui permettent d’atteindre l’objectif de gouvernance sous-jacent et de l’information supplémentaire devra être communiquée à ce sujet. ",null,null,"Display"]
[null,null,null,null,null,"Display"]
[null,null,null,null,null,"Display"]
[null,"1)","Composition du conseil d’administration",null,null,"Display"]
[null,null,null,null,null,"Display"]
[null,null,"Le conseil d’administration est composé majoritairement d’administrateurs indépendants.",null,null,"Display"]
[null,null,null,null,null,"Display"]
[null,null,"Le président du conseil est un administrateur indépendant. Si cela n’est pas approprié, un administrateur indépendant a été nommé pour agir comme administrateur principal et jouer le rôle de véritable chef du conseil afin de permettre au conseil de s’acquitter de ses fonctions.",null,null,"Display"]
[null,null,null,null,null,"Display"]
[null,"2) ","Réunions du conseil",null,null,"Display"]
[null,null,null,null,null,"Display"]
[null,null,"Les administrateurs indépendants tiennent des réunions périodiques sans la présence des membres de la direction. ",null,null,"Display"]
[null,null,null,null,null,"Display"]
[null,"3)","Mandat du conseil d’administration",null,null,"Display"]
[null,null,null,null,null,"Display"]
[null,null,"Le conseil d’administration dispose d’un mandat écrit décrivant ses responsabilités.",null,null,"Display"]
[null,null,null,null,null,"Display"]
[null,"4) ","Les responsabilités suivantes sont énoncées dans le mandat du conseil :",null,null,"Display"]
[null,null,null,null,null,"Display"]
[null,null,"S’assurer que le chef de la direction et les autres membres de la haute direction sont intègres; ",null,null,"Display"]
[null,null,null,null,null,"Display"]
[null,null,"S’assurer que le chef de la direction et les autres membres de la haute direction créent une culture d’intégrité dans l’ensemble de l’organisation; ",null,null,"Display"]
[null,null,null,null,null,"Display"]
[null,null,"Adopter un processus de planification stratégique comprenant les risques et les opportunités de l’entreprise; ",null,null,"Display"]
[null,null,null,null,null,"Display"]
[null,null,"S’assurer de l’approbation du plan stratégique une fois par an;",null,null,"Display"]
[null,null,null,null,null,"Display"]
[null,null,"Définir les principaux risques auxquels l’entreprise fait face;",null,null,"Display"]
[null,null,null,null,null,"Display"]
[null,null,"Veiller à la mise en œuvre de systèmes de gestion de ces risques;",null,null,"Display"]
[null,null,null,null,null,"Display"]
[null,null,"Planifier la relève;",null,null,"Display"]
[null,null,null,null,null,"Display"]
[null,null,"Adopter une politique de communication (selon les indications précisées dans l’Instruction générale 51-201 Lignes directrices en matière de communication de l’information);",null,null,"Display"]
[null,null,null,null,null,"Display"]
[null,null,null,null,null,"Display"]
[null,null,"À l'égard des systèmes de contrôle interne et d’information de gestion;",null,null,"Display"]
[null,null,null,null,null,"Display"]
[null,null,"Élaborer la vision de l’organisation en matière de gouvernance (c.-à-d. un ensemble de principes et de lignes directrices);",null,null,"Display"]
[null,null,null,null,null,"Display"]
[null,null,"Établir des mesures permettant aux porteurs de communiquer avec le conseil d’administration;",null,null,"Display"]
[null,null,null,null,null,"Display"]
[null,null,"Définir les attentes à l’endroit des administrateurs et leurs responsabilités.",null,null,"Display"]
[null,null,null,null,null,"Display"]
[null,"5)","Descriptions de poste",null,null,"Display"]
[null,null,null,null,null,"Display"]
[null,null,"Le conseil élabore ou approuve les objectifs de l’entreprise que le chef de la direction a la responsabilité d’atteindre.",null,null,"Display"]
[null,null,null,null,null,"Display"]
[null,"6) ","Le conseil d’administration a élaboré des descriptions de poste claires pour tous les postes suivants : ",null,null,"Display"]
[null,null,null,null,null,"Display"]
[null,null,"Président du conseil",null,null,"Display"]
[null,null,null,null,null,"Display"]
[null,null,"Président de chacun des comités du conseil",null,null,"Display"]
{"$rows_left_out":131}
{"sheet":"Partie 2a","index":2,"n_rows":166,"n_cols":6,"rows_kept":166,"cut":false,"hidden":false,"merged":[[160,2,163,3],[2,1,2,3],[158,1,158,3]]}
[null,null,null,null,null,"Filter"]
[null,null,null,null,null,"Display"]
[null,"Partie 2a – Liste de contrôle pour l’autoévaluation – \nInformation concernant les pratiques en matière \nde gouvernance (Règlement 58-101A1)",null,null,null,"Display"]
[null,null,null,null,null,"Display"]
[null,"Chacune des questions ci-dessous doit être précédée de la question suivante : ",null,null,null,"Display"]
[null,"« Communiquons-nous actuellement l’information adéquate pour être conformes à l'exigence relative à... ? »",null,null,null,"Display"]
[null,null,null,null,null,"Display"]
[null,"Les réponses possibles sont les suivantes : ",null,null,null,"Display"]
[null,"●","« Entièrement conforme » : aucune modification ne doit être apportée à la pratique actuelle, par conséquent aucun travail supplémentaire n’est requis.",null,null,"Display"]
[null,"●","« Partiellement conforme » : un effort supplémentaire sera nécessaire pour que les informations existantes soient conformes aux exigences.",null,null,"Display"]
[null,"●","« Non conforme » : beaucoup de travail devra être fait et de l’information supplémentaire devra être communiquée afin de satisfaire à l'exigence. ",null,null,"Display"]
[null,null,null,null,null,"Display"]
[null,"1)","Conseil d’administration",null,null,"Display"]
[null,null,null,null,null,"Display"]
[null,null,"Donner la liste de tous les administrateurs indépendants.","Partiellement conforme – des pratiques existantes doivent être modifiées",null,"Display"]
[null,null,null,null,null,"Display"]
[null,null,"Donner la liste de tous les administrateurs qui ne sont pas indépendants et indiquer le fondement de cette conclusion. ","Partiellement conforme – des pratiques existantes doivent être modifiées",null,"Display"]
[null,null,null,null,null,"Display"]
[null,null,"Indiquer si la majorité des administrateurs sont indépendants ou non. ","Partiellement conforme – des pratiques existantes doivent être modifiées",null,"Display"]
[null,null,null,null,null,"Display"]
[null,null,"Si une minorité d’administrateurs sont indépendants, décrire ce que le conseil fait pour favoriser l’indépendance de leur jugement dans l’exécution de leur mandat.","Partiellement conforme – des pratiques existantes doivent être modifiées",null,"Display"]
[null,null,null,null,null,"Display"]
[null,null,"Indiquer l’identité de tout administrateur qui est actuellement administrateur d’un autre émetteur assujetti dans un territoire du Canada ou dans un territoire étranger et indiquer l’identité de l’émetteur concerné. ","Partiellement conforme – des pratiques existantes doivent être modifiées",null,"Display"]
[null,null,null,null,null,"Display"]
[null,"2)","Indiquer si les administrateurs indépendants tiennent ou non des réunions périodiques hors de la présence des membres de la direction. ",null,null,"Display"]
[null,null,null,null,null,"Display"]
[null,null,"Dans l’affirmative, indiquer le nombre de réunions tenues au cours des douze derniers mois; ","Partiellement conforme – des pratiques existantes doivent être modifiées",null,"Display"]
[null,null,null,null,null,"Display"]
[null,null,"Dans la négative, décrire ce que fait le conseil d’administration pour favoriser la libre discussion entre les administrateurs indépendants. ","Partiellement conforme – des pratiques existantes doivent être modifiées",null,"Display"]
[null,null,null,null,null,"Display"]
[null,"3) ","Indiquer si le président du conseil est un administrateur indépendant : ",null,null,"Display"]
[null,null,null,null,null,"Display"]
[null,null,"Si le conseil d’administration a un président ou un administrateur principal qui est un administrateur indépendant, donner le nom de cette personne et exposer son rôle et ses responsabilités.","Partiellement conforme – des pratiques existantes doivent être modifiées",null,"Display"]
[null,null,null,null,null,"Display"]
[null,null,"Si le conseil n’a PAS de président indépendant ni d’administrateur principal indépendant, indiquer ce que le conseil a fait pour assurer un leadership aux administrateurs indépendants. ","Partiellement conforme – des pratiques existantes doivent être modifiées",null,"Display"]
[null,null,null,null,null,"Display"]
[null,"4) ","Mandat du conseil d’administration",null,null,"Display"]
[null,null,null,null,null,"Display"]
[null,null,"Donner le texte du mandat écrit du conseil d’administration. En l’absence de mandat écrit, indiquer de quelle façon le conseil définit son rôle et ses responsabilités.","Partiellement conforme – des pratiques existantes doivent être modifiées",null,"Display"]
[null,null,null,null,null,"Display"]
[null,"5)","Descriptions de poste",null,null,"Display"]
[null,null,null,null,null,"Display"]
[null,null,"Indiquer si le conseil d’administration a établi ou non une description de poste écrite pour les postes de président du conseil et de président de chaque comité du conseil. Si ces descriptions n’existent pas, indiquer comment le conseil définit le rôle et les responsabilités correspondant à chacun de ces postes.","Partiellement conforme – des pratiques existantes doivent être modifiées",null,"Display"]
[null,null,null,null,null,"Display"]
[null,null,"Indiquer si le conseil d’administration a établi ou non une description de poste écrite pour le poste de chef de la direction. Si cette description n’existe pas, indiquer comment le conseil définit le rôle et les responsabilités du chef de la direction. ","Partiellement conforme – des pratiques existantes doivent être modifiées",null,"Display"]
[null,null,null,null,null,"Display"]
[null,"6)","Orientation et formation continue",null,null,"Display"]
[null,null,null,null,null,"Display"]
[null,null,"Indiquer les mesures prises par le conseil d’administration pour orienter les nouveaux administrateurs en ce qui concerne le rôle du conseil, de ses comités et des administrateurs.","Partiellement conforme – des pratiques existantes doivent être modifiées",null,"Display"]
[null,null,null,null,null,"Display"]
[null,null,"Indiquer les mesures prises par le conseil d’administration pour orienter les nouveaux administrateurs en ce qui concerne la nature et le fonctionnement de l’entreprise de l’émetteur.","Partiellement conforme – des pratiques existantes doivent être modifiées",null,"Display"]
[null,null,null,null,null,"Display"]
[null,null,"Indiquer, le cas échéant, les mesures prises par le conseil d’administration pour assurer la formation continue des administrateurs. Si le conseil n’assure pas de formation continue, indiquer comment il veille à ce que les administrateurs aient les aptitudes et les connaissances adéquates pour s’acquitter de leurs obligations en tant qu’administrateurs.","Partiellement conforme – des pratiques existantes doivent être modifiées",null,"Display"]
[null,null,null,null,null,"Display"]
[null,"7) ","Éthique commerciale",null,null,"Display"]
[null,null,null,null,null,"Display"]
[null,null,"Indiquer si le conseil d’administration a adopté ou non un code d’éthique commerciale écrit à l’intention des administrateurs, des dirigeants et des salariés. ","Partiellement conforme – des pratiques existantes doivent être modifiées",null,"Display"]
[null,null,null,null,null,"Display"]
[null,null,"Indiquer les mesures prises par le conseil d’administration pour garantir l’exercice d’un jugement indépendant par les administrateurs lors de l’examen des opérations et des contrats dans lesquels un administrateur ou un membre de la haute direction a un intérêt important. ","Partiellement conforme – des pratiques existantes doivent être modifiées",null,"Display"]
[null,null,null,null,null,"Display"]
{"$rows_left_out":107}
{"sheet":"Partie 2b","index":3,"n_rows":125,"n_cols":6,"rows_kept":125,"cut":false,"hidden":false,"merged":[[2,1,2,3],[116,1,116,3],[118,2,121,3]]}
[null,null,null,null,null,"Filter"]
[null,null,null,null,null,"Display"]
[null,"Partie 2b – Liste de contrôle pour l’autoévaluation – \nInformation concernant les pratiques en matière \nde gouvernance (Règlement 58-101A2) – ÉMETTEUR ÉMERGENT",null,null,null,"Display"]
[null,null,null,null,null,"Display"]
[null,"Chacune des questions ci-dessous doit être précédée de la question suivante : ",null,null,null,"Display"]
[null,"« Communiquons-nous actuellement l’information adéquate pour être conformes à l'exigence relative à... ? »",null,null,null,"Display"]
[null,null,null,null,null,"Display"]
[null,"Les réponses possibles sont les suivantes : ",null,null,null,"Display"]
[null,"●","« Entièrement conforme » : aucune modification n’est à apporter à la pratique actuelle, par conséquent aucun travail supplémentaire n’est requis.",null,null,"Display"]
[null,"●","« Partiellement conforme » : un effort supplémentaire devra être fait pour faire en sorte que les informations existantes soient conformes aux exigences.",null,null,"Display"]
[null,"●","« Non conforme » : beaucoup de travail sera nécessaire et de l’information supplémentaire devra être fournie afin de satisfaire à l'exigence. ",null,null,"Display"]
[null,null,null,null,null,"Display"]
[null,"1) ","Conseil d’administration",null,null,"Display"]
[null,null,null,null,null,"Display"]
[null,null,"Indiquer comment le conseil facilite l’exercice de son indépendance dans la surveillance de la direction. ",null,null,"Display"]
[null,null,null,null,null,"Display"]
[null,null,"Indiquer le nom des administrateurs indépendants. ",null,null,"Display"]
[null,null,null,null,null,"Display"]
[null,null,"Indiquer le nom des administrateurs qui ne sont pas indépendants et le fondement de cette conclusion.",null,null,"Display"]
[null,null,null,null,null,"Display"]
[null,"2) ","Mandats d’administrateur",null,null,"Display"]
[null,null,null,null,null,"Display"]
[null,null,"Indiquer tout administrateur qui est actuellement administrateur d’un autre émetteur assujetti dans un territoire du Canada ou dans un territoire étranger et indiquer l’émetteur concerné. ",null,null,"Display"]
[null,null,null,null,null,"Display"]
[null,"3) ","Orientation et formation continue",null,null,"Display"]
[null,null,null,null,null,"Display"]
[null,null,"Indiquer, le cas échéant, les mesures prises par le conseil d’administration pour orienter les nouveaux administrateurs.",null,null,"Display"]
[null,null,null,null,null,"Display "]
[null,null,"Indiquer, le cas échéant, les mesures prises par le conseil d’administration pour assurer la formation continue des administrateurs.",null,null,"Display"]
[null,null,null,null,null,"Display"]
[null,"4) ","Éthique commerciale",null,null,"Display"]
[null,null,null,null,null,"Display"]
[null,null,"Indiquer, le cas échéant, les mesures prises par le conseil d’administration pour encourager et promouvoir une culture d’éthique commerciale. ",null,null,"Display"]
[null,null,null,null,null,"Display"]
[null,"5) ","Sélection des candidats au conseil d’administration",null,null,"Display"]
[null,null,null,null,null,"Display"]
[null,null,"Indiquer, le cas échéant, les mesures prises par le conseil pour trouver de nouveaux candidats au conseil d’administration.",null,null,"Display"]
[null,null,null,null,null,"Display"]
[null,null,"Indiquer les personnes qui sélectionnent les nouveaux candidats. ",null,null,"Display"]
[null,null,null,null,null,"Display"]
[null,null,"Décrire la procédure de sélection des nouveaux candidats.",null,null,"Display"]
[null,null,null,null,null,"Display"]
[null,"6) ","Rémunération ",null,null,"Display"]
[null,null,null,null,null,"Display"]
[null,null,"Indiquer, le cas échéant, les mesures prises par le conseil d’administration pour fixer la rémunération des administrateurs et du chef de la direction. ",null,null,"Display"]
[null,null,null,null,null,"Display"]
[null,null,"Indiquer les personnes qui fixent la rémunération;",null,null,"Display"]
[null,null,null,null,null,"Display"]
[null,null,"Indiquer la procédure de fixation de la rémunération. ",null,null,"Display"]
[null,null,null,null,null,"Display"]
[null,"7) ","Autres comités du conseil",null,null,"Display"]
[null,null,null,null,null,"Display"]
[null,null,"Si le conseil d’administration a d’autres comités permanents, outre le comité d’audit, le comité des candidatures et le comité de la rémunération, donner la liste de ces comités et leur fonction. ",null,null,"Display"]
[null,null,null,null,null,"Display"]
[null,"8)","Évaluation",null,null,"Display"]
[null,null,null,null,null,"Display"]
[null,null,"Indiquer si le conseil d’administration, les comités du conseil et chaque administrateur sont soumis ou non une évaluation régulière de leur efficacité et leur apport. ",null,null,"Display"]
[null,null,null,null,null,"Display"]
[null,null,"Si ces évaluations sont effectuées régulièrement, exposer la procédure utilisée. ",null,null,"Display"]
[null,null,null,null,null,"Display"]
{"$rows_left_out":66}
{"sheet":"Rating","index":4,"n_rows":11,"n_cols":4,"rows_kept":11,"cut":false,"hidden":true,"merged":[]}
[null,"Part 1","Part 2a","Part 2 b"]
["Total number of questions",64,53,36]
[]
["Total number \"Comply fully\"",{"$f":"COUNTIF('Partie 1'!D:D,\"Entièrement conforme\")","v":0},{"$f":"COUNTIF('Partie 2a'!D:D,\"Entièrement conforme\")","v":0},{"$f":"COUNTIF('Partie 2b'!D:D,\"Entièrement conforme\")","v":0}]
[]
["Percentage",{"$f":"B4/B2","v":0},{"$f":"C4/C2","v":0},{"$f":"D4/D2","v":0}]
[]
["Acceptable?",{"$f":"IF(B6>$B$11,\"Yes\",\"No\")","v":"No"},{"$f":"IF(C6>$B$11,\"Yes\",\"No\")","v":"No"},{"$f":"IF(D6>$B$11,\"Yes\",\"No\")","v":"No"}]
[]
[]
["Passing rate",0.8]

{"sheet":"Drop down","index":5,"n_rows":17,"n_cols":1,"rows_kept":17,"cut":false,"hidden":true,"merged":[]}
["Entièrement conforme"]
["Partiellement conforme – des pratiques existantes doivent être modifiées"]
["Non conforme – plus d’information doit être communiquée"]
["S.O."]
[]
[]
[]
[]
["Évaluer l’information communiquée sur les pratiques de notre société"]
["Quitter l’évaluation"]
[]
[]
[]
[]
[]
["Obligations pour toutes les autres sociétés ouvertes"]
["Obligations pour les émetteurs émergents"]